Reaction Details
TargetMatrix metalloproteinase-14
LigandBDBM50340768
Substrate/Competitorn/a
Meas. Tech.ChEMBL_811341 (CHEMBL2013521)
Ki>50000±n/a nM
Citation Jiao, GSKim, SMoayeri, MCrown, DThai, ACregar-Hernandez, LMcKasson, LSankaran, BLehrer, AWong, TJohns, LMargosiak, SALeppla, SHJohnson, AT Antidotes to anthrax lethal factor intoxication. Part 3: Evaluation of core structures and further modifications to the C2-side chain. Bioorg Med Chem Lett22:2242-6 (2012) 
 
Matrix metalloproteinase-14
Name:Matrix metalloproteinase-14
Type:Protein
Mol. Mass.:65900.19
Organism:Homo sapiens (Human)
Description:P50281
Residue:582
BDBM50340768
NameBDBM50340768
Synonyms:(R)-2-(4-fluoro-3,5-dimethylphenoxy)-6-(4-fluorobenzylamino)-N-hydroxyhexanamide | CHEMBL1760322
TypeSmall organic molecule
Emp. Form.C21H26F2N2O3
Mol. Mass.392.4395
SMILESCc1cc(O[C@H](CCCCNCc2ccc(F)cc2)C(=O)NO)cc(C)c1F