Reaction Details
TargetStromelysin-1
LigandBDBM50340768
Substrate/Competitorn/a
Meas. Tech.ChEMBL_811338 (CHEMBL2013518)
Ki>50000±n/a nM
Citation Jiao, GSKim, SMoayeri, MCrown, DThai, ACregar-Hernandez, LMcKasson, LSankaran, BLehrer, AWong, TJohns, LMargosiak, SALeppla, SHJohnson, AT Antidotes to anthrax lethal factor intoxication. Part 3: Evaluation of core structures and further modifications to the C2-side chain. Bioorg Med Chem Lett22:2242-6 (2012) 
 
Stromelysin-1
Name:Stromelysin-1
Type:Enzyme
Mol. Mass.:53973.13
Organism:Homo sapiens (Human)
Description: P08254
Residue:477
BDBM50340768
NameBDBM50340768
Synonyms:(R)-2-(4-fluoro-3,5-dimethylphenoxy)-6-(4-fluorobenzylamino)-N-hydroxyhexanamide | CHEMBL1760322
TypeSmall organic molecule
Emp. Form.C21H26F2N2O3
Mol. Mass.392.4395
SMILESCc1cc(O[C@H](CCCCNCc2ccc(F)cc2)C(=O)NO)cc(C)c1F