Reaction Details
TargetMatrix metalloproteinase-14
LigandBDBM50340758
Substrate/Competitorn/a
Meas. Tech.ChEMBL_811341 (CHEMBL2013521)
Ki>50000±n/a nM
Citation Jiao, GSKim, SMoayeri, MCrown, DThai, ACregar-Hernandez, LMcKasson, LSankaran, BLehrer, AWong, TJohns, LMargosiak, SALeppla, SHJohnson, AT Antidotes to anthrax lethal factor intoxication. Part 3: Evaluation of core structures and further modifications to the C2-side chain. Bioorg Med Chem Lett22:2242-6 (2012) 
 
Matrix metalloproteinase-14
Name:Matrix metalloproteinase-14
Type:Protein
Mol. Mass.:65900.19
Organism:Homo sapiens (Human)
Description:P50281
Residue:582
BDBM50340758
NameBDBM50340758
Synonyms:(S)-6-(4-fluorobenzylamino)-2-((R)-2-(4-fluorophenyl)-2-methoxyethyl)-N-hydroxyhexanamide | CHEMBL1760318
TypeSmall organic molecule
Emp. Form.C22H28F2N2O3
Mol. Mass.406.4661
SMILESCO[C@H](C[C@H](CCCCNCc1ccc(F)cc1)C(=O)NO)c1ccc(F)cc1