Reaction Details
TargetLethal factor
LigandBDBM50329265
Substrate/Competitorn/a
Meas. Tech.ChEMBL_811334 (CHEMBL2013514)
Ki 0.24±n/a nM
Citation Jiao, GSKim, SMoayeri, MCrown, DThai, ACregar-Hernandez, LMcKasson, LSankaran, BLehrer, AWong, TJohns, LMargosiak, SALeppla, SHJohnson, AT Antidotes to anthrax lethal factor intoxication. Part 3: Evaluation of core structures and further modifications to the C2-side chain. Bioorg Med Chem Lett22:2242-6 (2012) 
 
Lethal factor
Name:Lethal factor
Type:PROTEIN
Mol. Mass.:93758.56
Organism:Bacillus anthracis
Description:ChEMBL_1460338
Residue:809
BDBM50329265
NameBDBM50329265
Synonyms:(R)-2-(4-fluoro-3,5-dimethylphenylamino)-6-(4-fluorobenzylamino)-N-hydroxyhexanamide | CHEMBL1269994
TypeSmall organic molecule
Emp. Form.C21H27F2N3O2
Mol. Mass.391.4548
SMILESCc1cc(N[C@H](CCCCNCc2ccc(F)cc2)C(=O)NO)cc(C)c1F