Reaction Details
TargetSerine/threonine-protein kinase Chk1
LigandBDBM50379643
Substrate/Competitorn/a
Meas. Tech.ChEMBL_811848 (CHEMBL2014579)
IC50 0.030000±n/a nM
Citation Dudkin, VYWang, CArrington, KLFraley, MEHartman, GDStirdivant, SMDrakas, RARickert, KWalsh, ESHamilton, KBuser, CAHardwick, JTao, WBeck, SCMao, XLobell, RBSepp-Lorenzino, L Pyridyl aminothiazoles as potent Chk1 inhibitors: optimization of cellular activity. Bioorg Med Chem Lett22:2613-9 (2012) 
 
Serine/threonine-protein kinase Chk1
Name:Serine/threonine-protein kinase Chk1
Type:Enzyme Catalytic Domain
Mol. Mass.:54443.02
Organism:Homo sapiens (Human)
Description:gi_166295192
Residue:476
BDBM50379643
NameBDBM50379643
Synonyms:CHEMBL2011353
TypeSmall organic molecule
Emp. Form.C22H26N8O2S
Mol. Mass.466.559
SMILESCC(=O)N1CCN(CC1)c1ccnc(Nc2ncc(s2)-c2cncc(c2)C(=O)NCCN)c1