Reaction Details
TargetSerine/threonine-protein kinase Chk1
LigandBDBM50379634
Substrate/Competitorn/a
Meas. Tech.ChEMBL_811848 (CHEMBL2014579)
IC50 9±n/a nM
Citation Dudkin, VYWang, CArrington, KLFraley, MEHartman, GDStirdivant, SMDrakas, RARickert, KWalsh, ESHamilton, KBuser, CAHardwick, JTao, WBeck, SCMao, XLobell, RBSepp-Lorenzino, L Pyridyl aminothiazoles as potent Chk1 inhibitors: optimization of cellular activity. Bioorg Med Chem Lett22:2613-9 (2012) 
 
Serine/threonine-protein kinase Chk1
Name:Serine/threonine-protein kinase Chk1
Type:Enzyme Catalytic Domain
Mol. Mass.:54443.02
Organism:Homo sapiens (Human)
Description:gi_166295192
Residue:476
BDBM50379634
NameBDBM50379634
Synonyms:CHEMBL2013065
TypeSmall organic molecule
Emp. Form.C19H18N8OS
Mol. Mass.406.464
SMILESC1CN(CCO1)c1ccnc(Nc2ncc(s2)-c2cncc(c2)-n2ccnn2)c1