Reaction Details
TargetCyclin-dependent kinase 7
LigandBDBM50379621
Substrate/Competitorn/a
Meas. Tech.ChEMBL_811849 (CHEMBL2014580)
IC50 1000±n/a nM
Citation Dudkin, VYWang, CArrington, KLFraley, MEHartman, GDStirdivant, SMDrakas, RARickert, KWalsh, ESHamilton, KBuser, CAHardwick, JTao, WBeck, SCMao, XLobell, RBSepp-Lorenzino, L Pyridyl aminothiazoles as potent Chk1 inhibitors: optimization of cellular activity. Bioorg Med Chem Lett22:2613-9 (2012) 
 
Cyclin-dependent kinase 7
Name:Cyclin-dependent kinase 7
Type:Enzyme Subunit
Mol. Mass.:39047.01
Organism:Homo sapiens (Human)
Description:n/a
Residue:346
BDBM50379621
NameBDBM50379621
Synonyms:CHEMBL2013061
TypeSmall organic molecule
Emp. Form.C18H20N6S
Mol. Mass.352.457
SMILESCc1ccc(cn1)-c1cnc(Nc2cccc(n2)N2CCNCC2)s1