Reaction Details
TargetMultidrug resistance-associated protein 1
LigandBDBM50379653
Substrate/Competitorn/a
Meas. Tech.ChEMBL_811892 (CHEMBL2013262)
IC50 14900±n/a nM
Citation Sheng, XCAppleby, TButler, TCai, RChen, XCho, AClarke, MOCottell, JDelaney, WEDoerffler, ELink, JJi, MPakdaman, RPyun, HJWu, QXu, JKim, CU Discovery of GS-9451: an acid inhibitor of the hepatitis C virus NS3/4A protease. Bioorg Med Chem Lett22:2629-34 (2012) 
 
Multidrug resistance-associated protein 1
Name:Multidrug resistance-associated protein 1
Type:n/a
Mol. Mass.:171597.72
Organism:Homo sapiens (Human)
Description:P33527
Residue:1531
BDBM50379653
NameBDBM50379653
Synonyms:CHEMBL2013174 | GS-9451
TypeSmall organic molecule
Emp. Form.C45H60ClN7O9S
Mol. Mass.910.517
SMILESCC[C@@H]1C[C@]1(NC(=O)[C@@H]1C[C@H](CN1C(=O)[C@@H](NC(=O)O[C@@H]1C[C@@H]2C[C@@H]2C1)C(C)(C)C)Oc1cc(nc2c(Cl)c(OCCN3CCOCC3)ccc12)-c1csc(NC(C)C)n1)C(O)=O