Reaction Details
TargetBroad substrate specificity ATP-binding cassette transporter ABCG2
LigandBDBM50379653
Substrate/Competitorn/a
Meas. Tech.ChEMBL_811894 (CHEMBL2013264)
IC50 1400±n/a nM
Citation Sheng, XCAppleby, TButler, TCai, RChen, XCho, AClarke, MOCottell, JDelaney, WEDoerffler, ELink, JJi, MPakdaman, RPyun, HJWu, QXu, JKim, CU Discovery of GS-9451: an acid inhibitor of the hepatitis C virus NS3/4A protease. Bioorg Med Chem Lett22:2629-34 (2012) 
 
Broad substrate specificity ATP-binding cassette transporter ABCG2
Name:Broad substrate specificity ATP-binding cassette transporter ABCG2
Type:Multi-pass membrane protein; monomer or homodimer; disulfide-linked
Mol. Mass.:72329.48
Organism:Homo sapiens (Human)
Description:Q9UNQ0
Residue:655
BDBM50379653
NameBDBM50379653
Synonyms:CHEMBL2013174 | GS-9451
TypeSmall organic molecule
Emp. Form.C45H60ClN7O9S
Mol. Mass.910.517
SMILESCC[C@@H]1C[C@]1(NC(=O)[C@@H]1C[C@H](CN1C(=O)[C@@H](NC(=O)O[C@@H]1C[C@@H]2C[C@@H]2C1)C(C)(C)C)Oc1cc(nc2c(Cl)c(OCCN3CCOCC3)ccc12)-c1csc(NC(C)C)n1)C(O)=O