Reaction Details
TargetGlutamate receptor ionotropic, NMDA 2B
LigandBDBM50379668
Substrate/Competitorn/a
Meas. Tech.ChEMBL_812025 (CHEMBL2013395)
IC50 39.81±n/a nM
Citation Davies, DJCrowe, MLucas, NQuinn, JMiller, DDPritchard, SGrose, DBettini, ECalcinaghi, NVirginio, CAbberley, LGoldsmith, PMichel, ADChessell, IPKew, JNMiller, NDGunthorpe, MJ A novel series of benzimidazole NR2B-selective NMDA receptor antagonists. Bioorg Med Chem Lett22:2620-3 (2012) 
 
Glutamate receptor ionotropic, NMDA 2B
Name:Glutamate receptor ionotropic, NMDA 2B
Type:PROTEIN
Mol. Mass.:166375.46
Organism:Homo sapiens (Human)
Description:ChEMBL_1438829
Residue:1484
BDBM50379668
NameBDBM50379668
Synonyms:CHEMBL2013200
TypeSmall organic molecule
Emp. Form.C18H19N3O2
Mol. Mass.309.3624
SMILESOc1ccc2nc([nH]c2c1CN1CCOCC1)-c1ccccc1