Reaction Details
TargetGlutamate receptor ionotropic, NMDA 2B
LigandBDBM50379685
Substrate/Competitorn/a
Meas. Tech.ChEMBL_812025 (CHEMBL2013395)
IC50 200±n/a nM
Citation Davies, DJCrowe, MLucas, NQuinn, JMiller, DDPritchard, SGrose, DBettini, ECalcinaghi, NVirginio, CAbberley, LGoldsmith, PMichel, ADChessell, IPKew, JNMiller, NDGunthorpe, MJ A novel series of benzimidazole NR2B-selective NMDA receptor antagonists. Bioorg Med Chem Lett22:2620-3 (2012) 
 
Glutamate receptor ionotropic, NMDA 2B
Name:Glutamate receptor ionotropic, NMDA 2B
Type:PROTEIN
Mol. Mass.:166375.46
Organism:Homo sapiens (Human)
Description:ChEMBL_1438829
Residue:1484
BDBM50379685
NameBDBM50379685
Synonyms:CHEMBL2010885
TypeSmall organic molecule
Emp. Form.C20H22FN3
Mol. Mass.323.4072
SMILESFc1ccc2nc([nH]c2c1CN1CCCCCC1)-c1ccccc1