Reaction Details
TargetCytochrome P450 2D6
LigandBDBM50379681
Substrate/Competitorn/a
Meas. Tech.ChEMBL_812034 (CHEMBL2013460)
IC50 5000±n/a nM
Citation Davies, DJCrowe, MLucas, NQuinn, JMiller, DDPritchard, SGrose, DBettini, ECalcinaghi, NVirginio, CAbberley, LGoldsmith, PMichel, ADChessell, IPKew, JNMiller, NDGunthorpe, MJ A novel series of benzimidazole NR2B-selective NMDA receptor antagonists. Bioorg Med Chem Lett22:2620-3 (2012) 
 
Cytochrome P450 2D6
Name:Cytochrome P450 2D6
Type:Protein
Mol. Mass.:55774.82
Organism:Homo sapiens (Human)
Description:P10635
Residue:497
BDBM50379681
NameBDBM50379681
Synonyms:CHEMBL2010880
TypeSmall organic molecule
Emp. Form.C19H21N3
Mol. Mass.291.3901
SMILESC(N1CCCCC1)c1cccc2nc([nH]c12)-c1ccccc1