Reaction Details
TargetCannabinoid receptor 1
LigandBDBM50379699
Substrate/Competitorn/a
Meas. Tech.ChEMBL_812048 (CHEMBL2013474)
Ki>10000±n/a nM
Citation Nelson, DWFrost, JMTietje, KRFlorjancic, ASRyther, KCarroll, WADart, MJDaza, AVHooker, BAGrayson, GKFan, YGarrison, TREl-Kouhen, OFYao, BPai, MChandran, PZhu, CHsieh, GCMeyer, MD Synthesis and evaluation of 2-amido-3-carboxamide thiophene CB2 receptor agonists for pain management. Bioorg Med Chem Lett22:2604-8 (2012) 
 
Cannabinoid receptor 1
Name:Cannabinoid receptor 1
Type:G Protein-Coupled Receptor (GPCR)
Mol. Mass.:52868.96
Organism:Homo sapiens (Human)
Description:P21554
Residue:472
BDBM50379699
NameBDBM50379699
Synonyms:CHEMBL2010909
TypeSmall organic molecule
Emp. Form.C19H18F4N2O3S
Mol. Mass.430.416
SMILESCCCNC(=O)c1c(NC(=O)c2c(F)cccc2C(F)(F)F)sc2COCCc12