Reaction Details
TargetCannabinoid receptor 1
LigandBDBM50379692
Substrate/Competitorn/a
Meas. Tech.ChEMBL_812048 (CHEMBL2013474)
Ki>10000±n/a nM
Citation Nelson, DWFrost, JMTietje, KRFlorjancic, ASRyther, KCarroll, WADart, MJDaza, AVHooker, BAGrayson, GKFan, YGarrison, TREl-Kouhen, OFYao, BPai, MChandran, PZhu, CHsieh, GCMeyer, MD Synthesis and evaluation of 2-amido-3-carboxamide thiophene CB2 receptor agonists for pain management. Bioorg Med Chem Lett22:2604-8 (2012) 
 
Cannabinoid receptor 1
Name:Cannabinoid receptor 1
Type:G Protein-Coupled Receptor (GPCR)
Mol. Mass.:52868.96
Organism:Homo sapiens (Human)
Description:P21554
Residue:472
BDBM50379692
NameBDBM50379692
Synonyms:CHEMBL2010907
TypeSmall organic molecule
Emp. Form.C22H30N2O3S
Mol. Mass.402.55
SMILESCCCNC(=O)c1c(NC(=O)C23CC4CC(CC(C4)C2)C3)sc2COCCc12