Reaction Details
TargetCannabinoid receptor 2
LigandBDBM50379701
Substrate/Competitorn/a
Meas. Tech.ChEMBL_812046 (CHEMBL2013472)
Ki 104.71±n/a nM
Citation Nelson, DWFrost, JMTietje, KRFlorjancic, ASRyther, KCarroll, WADart, MJDaza, AVHooker, BAGrayson, GKFan, YGarrison, TREl-Kouhen, OFYao, BPai, MChandran, PZhu, CHsieh, GCMeyer, MD Synthesis and evaluation of 2-amido-3-carboxamide thiophene CB2 receptor agonists for pain management. Bioorg Med Chem Lett22:2604-8 (2012) 
 
Cannabinoid receptor 2
Name:Cannabinoid receptor 2
Type:G Protein-Coupled Receptor (GPCR)
Mol. Mass.:39690.94
Organism:Homo sapiens (Human)
Description:P34972
Residue:360
BDBM50379701
NameBDBM50379701
Synonyms:CHEMBL2010906
TypeSmall organic molecule
Emp. Form.C19H26N2O3S
Mol. Mass.362.486
SMILESCCCNC(=O)c1c(NC(=O)C2CC3CCC2C3)sc2COCCc12