Reaction Details
TargetCannabinoid receptor 1
LigandBDBM50379695
Substrate/Competitorn/a
Meas. Tech.ChEMBL_812049 (CHEMBL2013475)
Ki 302±n/a nM
Citation Nelson, DWFrost, JMTietje, KRFlorjancic, ASRyther, KCarroll, WADart, MJDaza, AVHooker, BAGrayson, GKFan, YGarrison, TREl-Kouhen, OFYao, BPai, MChandran, PZhu, CHsieh, GCMeyer, MD Synthesis and evaluation of 2-amido-3-carboxamide thiophene CB2 receptor agonists for pain management. Bioorg Med Chem Lett22:2604-8 (2012) 
 
Cannabinoid receptor 1
Name:Cannabinoid receptor 1
Type:G Protein-Coupled Receptor (GPCR)
Mol. Mass.:52856.55
Organism:Rattus norvegicus (rat)
Description:P20272
Residue:473
BDBM50379695
NameBDBM50379695
Synonyms:CHEMBL2010898
TypeSmall organic molecule
Emp. Form.C21H28N2O3S
Mol. Mass.388.524
SMILESCCCNC(=O)c1c(NC(=O)C23CC4CC2CC(C3)C4)sc2COCCc12