Reaction Details
TargetSerine/threonine-protein kinase Chk1
LigandBDBM50379770
Substrate/Competitorn/a
Meas. Tech.ChEMBL_812462 (CHEMBL2014248)
IC50 0.270000±n/a nM
Citation Dudkin, VYRickert, KKreatsoulas, CWang, CArrington, KLFraley, MEHartman, GDYan, YIkuta, MStirdivant, SMDrakas, RAWalsh, ESHamilton, KBuser, CALobell, RBSepp-Lorenzino, L Pyridyl aminothiazoles as potent inhibitors of Chk1 with slow dissociation rates. Bioorg Med Chem Lett22:2609-12 (2012) 
 
Serine/threonine-protein kinase Chk1
Name:Serine/threonine-protein kinase Chk1
Type:Enzyme Catalytic Domain
Mol. Mass.:54443.02
Organism:Homo sapiens (Human)
Description:gi_166295192
Residue:476
BDBM50379770
NameBDBM50379770
Synonyms:CHEMBL2011359
TypeSmall organic molecule
Emp. Form.C20H22N6O2S
Mol. Mass.410.493
SMILESNCCC(=O)c1cncc(c1)-c1cnc(Nc2cc(ccn2)N2CCOCC2)s1