Reaction Details
TargetSerine/threonine-protein kinase Chk1
LigandBDBM50379632
Substrate/Competitorn/a
Meas. Tech.ChEMBL_812462 (CHEMBL2014248)
IC50 8±n/a nM
Citation Dudkin, VYRickert, KKreatsoulas, CWang, CArrington, KLFraley, MEHartman, GDYan, YIkuta, MStirdivant, SMDrakas, RAWalsh, ESHamilton, KBuser, CALobell, RBSepp-Lorenzino, L Pyridyl aminothiazoles as potent inhibitors of Chk1 with slow dissociation rates. Bioorg Med Chem Lett22:2609-12 (2012) 
 
Serine/threonine-protein kinase Chk1
Name:Serine/threonine-protein kinase Chk1
Type:Enzyme Catalytic Domain
Mol. Mass.:54443.02
Organism:Homo sapiens (Human)
Description:gi_166295192
Residue:476
BDBM50379632
NameBDBM50379632
Synonyms:CHEMBL2011349
TypeSmall organic molecule
Emp. Form.C20H20N8S
Mol. Mass.404.491
SMILESC1CN(CCN1)c1ccnc(Nc2ncc(s2)-c2cncc(c2)-c2cn[nH]c2)c1