Reaction Details
Target5-hydroxytryptamine receptor 2C
LigandBDBM50379800
Substrate/Competitorn/a
Meas. Tech.ChEMBL_809690 (CHEMBL2016001)
Ki 931±n/a nM
Citation Conway, RJValant, CChristopoulos, ARobertson, ADCapuano, BCrosby, IT Synthesis and SAR study of 4-arylpiperidines and 4-aryl-1,2,3,6-tetrahydropyridines as 5-HT2C agonists. Bioorg Med Chem Lett22:2560-4 (2012) 
 
5-hydroxytryptamine receptor 2C
Name:5-hydroxytryptamine receptor 2C
Type:G Protein-Coupled Receptor (GPCR)
Mol. Mass.:51836.79
Organism:Homo sapiens (Human)
Description:P28335
Residue:458
BDBM50379800
NameBDBM50379800
Synonyms:CHEMBL2011556
TypeSmall organic molecule
Emp. Form.C11H15ClN
Mol. Mass.196.696
SMILESClc1cccc(c1)C1CC[NH2+]CC1