Reaction Details
TargetHeat shock protein HSP 90-beta
LigandBDBM50379853
Substrate/Competitorn/a
Meas. Tech.ChEMBL_809755 (CHEMBL2016174)
IC50 11±n/a nM
Citation Huang, KHBarta, TERice, JWSmith, EDOmmen, AJMa, WVeal, JMFadden, RPBarabasz, AFFoley, BEHughes, PFHanson, GJMarkworth, CJSilinski, MPartridge, JMSteed, PMHall, SE Discovery of novel aminoquinazolin-7-yl 6,7-dihydro-indol-4-ones as potent, selective inhibitors of heat shock protein 90. Bioorg Med Chem Lett22:2550-4 (2012) 
 
Heat shock protein HSP 90-beta
Name:Heat shock protein HSP 90-beta
Type:Molecular Chaperone
Mol. Mass.:83229.45
Organism:Homo sapiens (Human)
Description:P08238
Residue:724
BDBM50379853
NameBDBM50379853
Synonyms:CHEMBL2011854
TypeSmall organic molecule
Emp. Form.C20H22N4O
Mol. Mass.334.4149
SMILESCc1cn(c2CC(C)(C)CC(=O)c12)-c1ccc2c(C)nc(N)nc2c1