Reaction Details
TargetMetabotropic glutamate receptor 1
LigandBDBM50379861
Substrate/Competitorn/a
Meas. Tech.ChEMBL_809761 (CHEMBL2016180)
IC50 9±n/a nM
Citation Fisher, MJBacker, RTBarth, VNGarbison, KEGruber, JMHeinz, BAIyengar, SHollinshead, SPKingston, AKuklish, SLLi, LNisenbaum, ESPeters, SCPhebus, LSimmons, RMvan der Aar, E 3-Phenyl-5-isothiazole carboxamides with potent mGluR1 antagonist activity. Bioorg Med Chem Lett22:2514-7 (2012) 
 
Metabotropic glutamate receptor 1
Name:Metabotropic glutamate receptor 1
Type:Enzyme
Mol. Mass.:132358.19
Organism:Homo sapiens (Human)
Description:Q13255
Residue:1194
BDBM50379861
NameBDBM50379861
Synonyms:CHEMBL2011876
TypeSmall organic molecule
Emp. Form.C15H15ClN2OS
Mol. Mass.306.81
SMILESC[C@@H]1C[C@H]1C(=O)Nc1snc(c1C)-c1ccc(Cl)cc1