Reaction Details
TargetMetabotropic glutamate receptor 1
LigandBDBM50379862
Substrate/Competitorn/a
Meas. Tech.ChEMBL_809763 (CHEMBL2016182)
IC50 0.9±n/a nM
Citation Fisher, MJBacker, RTBarth, VNGarbison, KEGruber, JMHeinz, BAIyengar, SHollinshead, SPKingston, AKuklish, SLLi, LNisenbaum, ESPeters, SCPhebus, LSimmons, RMvan der Aar, E 3-Phenyl-5-isothiazole carboxamides with potent mGluR1 antagonist activity. Bioorg Med Chem Lett22:2514-7 (2012) 
 
Metabotropic glutamate receptor 1
Name:Metabotropic glutamate receptor 1
Type:Enzyme Catalytic Domain
Mol. Mass.:133240.47
Organism:RAT
Description:metabotropic glutamate 1/2 0 RAT::P23385
Residue:1199
BDBM50379862
NameBDBM50379862
Synonyms:CHEMBL2011870
TypeSmall organic molecule
Emp. Form.C16H18N2O2S
Mol. Mass.302.391
SMILESCOc1ccc(cc1)-c1nsc(NC(=O)[C@@H]2C[C@H]2C)c1C