Reaction Details
TargetBeta-secretase 1
LigandBDBM50379898
Substrate/Competitorn/a
Meas. Tech.ChEMBL_809981 (CHEMBL2015090)
Ki 110±n/a nM
Citation Cumming, JNSmith, EMWang, LMisiaszek, JDurkin, JPan, JIserloh, UWu, YZhu, ZStrickland, CVoigt, JChen, XKennedy, MEKuvelkar, RHyde, LACox, KFavreau, LCzarniecki, MFGreenlee, WJMcKittrick, BAParker, EMStamford, AW Structure based design of iminohydantoin BACE1 inhibitors: identification of an orally available, centrally active BACE1 inhibitor. Bioorg Med Chem Lett22:2444-9 (2012) 
 
Beta-secretase 1
Name:Beta-secretase 1
Type:Protein
Mol. Mass.:55755.10
Organism:Homo sapiens (Human)
Description:P56817
Residue:501
BDBM50379898
NameBDBM50379898
Synonyms:CHEMBL2011983
TypeSmall organic molecule
Emp. Form.C21H18N4O
Mol. Mass.342.3938
SMILESCN1C(N)=N[C@](C1=O)(c1ccccc1)c1cccc(c1)-c1cccnc1