Reaction Details
TargetBeta-secretase 1
LigandBDBM50379882
Substrate/Competitorn/a
Meas. Tech.ChEMBL_809981 (CHEMBL2015090)
Ki 190±n/a nM
Citation Cumming, JNSmith, EMWang, LMisiaszek, JDurkin, JPan, JIserloh, UWu, YZhu, ZStrickland, CVoigt, JChen, XKennedy, MEKuvelkar, RHyde, LACox, KFavreau, LCzarniecki, MFGreenlee, WJMcKittrick, BAParker, EMStamford, AW Structure based design of iminohydantoin BACE1 inhibitors: identification of an orally available, centrally active BACE1 inhibitor. Bioorg Med Chem Lett22:2444-9 (2012) 
 
Beta-secretase 1
Name:Beta-secretase 1
Type:Protein
Mol. Mass.:55755.10
Organism:Homo sapiens (Human)
Description:P56817
Residue:501
BDBM50379882
NameBDBM50379882
Synonyms:CHEMBL2011967
TypeSmall organic molecule
Emp. Form.C23H21N3O2
Mol. Mass.371.4317
SMILESCOc1cccc(c1)-c1cccc(c1)C1(N=C(N)N(C)C1=O)c1ccccc1