Reaction Details
TargetBeta-secretase 2
LigandBDBM50379880
Substrate/Competitorn/a
Meas. Tech.ChEMBL_809985 (CHEMBL2015094)
Ki 7.8±n/a nM
Citation Cumming, JNSmith, EMWang, LMisiaszek, JDurkin, JPan, JIserloh, UWu, YZhu, ZStrickland, CVoigt, JChen, XKennedy, MEKuvelkar, RHyde, LACox, KFavreau, LCzarniecki, MFGreenlee, WJMcKittrick, BAParker, EMStamford, AW Structure based design of iminohydantoin BACE1 inhibitors: identification of an orally available, centrally active BACE1 inhibitor. Bioorg Med Chem Lett22:2444-9 (2012) 
 
Beta-secretase 2
Name:Beta-secretase 2
Type:Protein
Mol. Mass.:56171.20
Organism:Homo sapiens (Human)
Description:Q9Y5Z0
Residue:518
BDBM50379880
NameBDBM50379880
Synonyms:CHEMBL2012001
TypeSmall organic molecule
Emp. Form.C20H21N3O2
Mol. Mass.335.3996
SMILESCOc1cccc(c1)-c1cccc(c1)C1(N=C(N)N(C)C1=O)C1CC1