Reaction Details
TargetcAMP-specific 3',5'-cyclic phosphodiesterase 4B
LigandBDBM50379961
Substrate/Competitorn/a
Meas. Tech.ChEMBL_810011 (CHEMBL2015120)
IC50 0.05±n/a nM
Citation Kuang, RShue, HJXiao, LBlythin, DJShih, NYChen, XGu, DSchwerdt, JLin, LTing, PCCao, JAslanian, RPiwinski, JJPrelusky, DWu, PZhang, JZhang, XCelly, CSBillah, MWang, P Discovery of oxazole-based PDE4 inhibitors with picomolar potency. Bioorg Med Chem Lett22:2594-7 (2012) 
 
cAMP-specific 3',5'-cyclic phosphodiesterase 4B
Name:cAMP-specific 3',5'-cyclic phosphodiesterase 4B
Type:Protein
Mol. Mass.:83318.87
Organism:Homo sapiens (Human)
Description:Q07343
Residue:736
BDBM50379961
NameBDBM50379961
Synonyms:CHEMBL2012226
TypeSmall organic molecule
Emp. Form.C24H19F5N4O3
Mol. Mass.506.4247
SMILESCOc1ccc(-c2nc(C(=O)NCc3c(F)cccc3F)c(o2)[C@H](C)N)c2ccc(nc12)C(F)(F)F