Reaction Details
TargetcAMP-specific 3',5'-cyclic phosphodiesterase 4B
LigandBDBM50379984
Substrate/Competitorn/a
Meas. Tech.ChEMBL_810011 (CHEMBL2015120)
IC50 0.04±n/a nM
Citation Kuang, RShue, HJXiao, LBlythin, DJShih, NYChen, XGu, DSchwerdt, JLin, LTing, PCCao, JAslanian, RPiwinski, JJPrelusky, DWu, PZhang, JZhang, XCelly, CSBillah, MWang, P Discovery of oxazole-based PDE4 inhibitors with picomolar potency. Bioorg Med Chem Lett22:2594-7 (2012) 
 
cAMP-specific 3',5'-cyclic phosphodiesterase 4B
Name:cAMP-specific 3',5'-cyclic phosphodiesterase 4B
Type:Protein
Mol. Mass.:83318.87
Organism:Homo sapiens (Human)
Description:Q07343
Residue:736
BDBM50379984
NameBDBM50379984
Synonyms:CHEMBL2012232
TypeSmall organic molecule
Emp. Form.C24H18F6N4O3
Mol. Mass.524.4151
SMILESCOc1ccc(-c2nc(C(=O)NCc3c(F)cc(F)cc3F)c(o2)[C@H](C)N)c2ccc(nc12)C(F)(F)F