Reaction Details
Target1-deoxy-D-xylulose 5-phosphate reductoisomerase
LigandBDBM50181153
Substrate/Competitorn/a
Meas. Tech.ChEMBL_810561 (CHEMBL2015311)
IC50 320±n/a nM
Citation Ponaire, SZinglé, CTritsch, DGrosdemange-Billiard, CRohmer, M Growth inhibition of Mycobacterium smegmatis by prodrugs of deoxyxylulose phosphate reducto-isomerase inhibitors, promising anti-mycobacterial agents. Eur J Med Chem51:277-85 (2012) 
 
1-deoxy-D-xylulose 5-phosphate reductoisomerase
Name:1-deoxy-D-xylulose 5-phosphate reductoisomerase
Type:PROTEIN
Mol. Mass.:41046.78
Organism:Mycobacterium smegmatis (strain ATCC 700084 / mc(2)155)
Description:ChEMBL_810561
Residue:398
BDBM50181153
NameBDBM50181153
Synonyms:3-(N-hydroxyacetamido)propylphosphonic acid CHEMBL205338 ammonium 3-(N-hydroxyacetamido)propylphosphonate
TypeSmall organic molecule
Emp. Form.C5H12NO5P
Mol. Mass.197.1262
SMILESCC(=O)N(O)CCCP(O)(O)=O