Reaction Details
TargetProteinase-activated receptor 1
LigandBDBM50380018
Substrate/Competitorn/a
Meas. Tech.ChEMBL_810573 (CHEMBL2015551)
IC50 8.1±n/a nM
Citation Chelliah, MVChackalamannil, SXia, YEagen, KGreenlee, WJAhn, HSAgans-Fantuzzi, JBoykow, GHsieh, YBryant, MChan, TMChintala, M Discovery of nor-seco himbacine analogs as thrombin receptor antagonists. Bioorg Med Chem Lett22:2544-9 (2012) 
 
Proteinase-activated receptor 1
Name:Proteinase-activated receptor 1
Type:Protein
Mol. Mass.:47450.07
Organism:Homo sapiens (Human)
Description:P25116
Residue:425
BDBM50380018
NameBDBM50380018
Synonyms:CHEMBL2012505
TypeSmall organic molecule
Emp. Form.C26H31NO4
Mol. Mass.421.5286
SMILESCC[C@@H]1[C@@H](C)C[C@]2(O)[C@@H]([C@@H](C)OC2=O)[C@H]1\C=C\c1ccc(cn1)-c1ccccc1OC