Reaction Details
TargetAngiopoietin-1 receptor
LigandBDBM50017698
Substrate/Competitorn/a
Meas. Tech.ChEMBL_810765 (CHEMBL2016084)
Kd 5900±n/a nM
Citation Gong, XWMai, JHXu, YH Discovery of loperamide as an antagonist of angiopoietin1 and angiopoietin2 by virtual screening. Bioorg Med Chem Lett22:2388-92 (2012) 
 
Angiopoietin-1 receptor
Name:Angiopoietin-1 receptor
Type:Enzyme
Mol. Mass.:125835.70
Organism:Homo sapiens (Human)
Description:Q02763
Residue:1124
BDBM50017698
NameBDBM50017698
Synonyms:4-(4-(4-chlorophenyl)-4-hydroxypiperidin-1-yl)-N,N-dimethyl-2,2-diphenylbutanamide 4-[4-(4-Chloro-phenyl)-4-hydroxy-piperidin-1-yl]-N,N-dimethyl-2,2-diphenyl-butyramide(loperamide) Imodium LOPERAMIDE HYDROCHLORIDE med.21724, Compound 184
TypeSmall organic molecule
Emp. Form.C29H33ClN2O2
Mol. Mass.477.038
SMILESCN(C)C(=O)C(CCN1CCC(O)(CC1)c1ccc(Cl)cc1)(c1ccccc1)c1ccccc1