Reaction Details
TargetAtypical chemokine receptor 3
LigandBDBM50380131
Substrate/Competitorn/a
Meas. Tech.ChEMBL_811527 (CHEMBL2013881)
EC50 1±n/a nM
Citation Wijtmans, MMaussang, DSirci, FScholten, DJCanals, MMujic-Delic, AChong, MChatalic, KLCusters, HJanssen, Ede Graaf, CSmit, MJde Esch, IJLeurs, R Synthesis, modeling and functional activity of substituted styrene-amides as small-molecule CXCR7 agonists. Eur J Med Chem51:184-92 (2012) 
 
Atypical chemokine receptor 3
Name:Atypical chemokine receptor 3
Type:Enzyme
Mol. Mass.:41498.84
Organism:Homo sapiens (Human)
Description:P25106
Residue:362
BDBM50380131
NameBDBM50380131
Synonyms:CHEMBL2013231
TypeSmall organic molecule
Emp. Form.C26H33FN2O3
Mol. Mass.440.5502
SMILESCOc1ccc(cc1OC)C(=O)N(CCC1CCCN1C)C\C(C)=C\c1ccccc1F