Reaction Details
TargetCarbonic anhydrase 2
LigandBDBM50380140
Substrate/Competitorn/a
Meas. Tech.ChEMBL_811723 (CHEMBL2014298)
Kd 330±n/a nM
Citation Capkauskaite, EZubriene, ABaranauskiene, LTamulaitiene, GManakova, EKairys, VGražulis, STumkevicius, SMatulis, D Design of [(2-pyrimidinylthio)acetyl]benzenesulfonamides as inhibitors of human carbonic anhydrases. Eur J Med Chem51:259-70 (2012) 
 
Carbonic anhydrase 2
Name:Carbonic anhydrase 2
Type:Enzyme
Mol. Mass.:29250.71
Organism:Homo sapiens (Human)
Description:P00918
Residue:260
BDBM50380140
NameBDBM50380140
Synonyms:CHEMBL2011155 | carbonic anhydrase (CA) inhibitors, benzenesulphonamide ligand, 10
TypeSmall organic molecule
Emp. Form.C12H10ClN3O3S2
Mol. Mass.343.809
SMILESNS(=O)(=O)c1cc(ccc1Cl)C(=O)CSc1ncccn1