Reaction Details
TargetCarbonic anhydrase 2
LigandBDBM50380147
Substrate/Competitorn/a
Meas. Tech.ChEMBL_811724 (CHEMBL2014299)
Kd 77±n/a nM
Citation Capkauskaite, EZubriene, ABaranauskiene, LTamulaitiene, GManakova, EKairys, VGražulis, STumkevicius, SMatulis, D Design of [(2-pyrimidinylthio)acetyl]benzenesulfonamides as inhibitors of human carbonic anhydrases. Eur J Med Chem51:259-70 (2012) 
 
Carbonic anhydrase 2
Name:Carbonic anhydrase 2
Type:Enzyme
Mol. Mass.:29250.71
Organism:Homo sapiens (Human)
Description:P00918
Residue:260
BDBM50380147
NameBDBM50380147
Synonyms:CHEMBL2011158
TypeSmall organic molecule
Emp. Form.C14H13NO3S2
Mol. Mass.307.388
SMILESNS(=O)(=O)c1ccc(cc1)C(=O)CSc1ccccc1