Reaction Details
TargetCarbonic anhydrase 1
LigandBDBM50380147
Substrate/Competitorn/a
Meas. Tech.ChEMBL_811722 (CHEMBL2014297)
Kd 100±n/a nM
Citation Capkauskaite, EZubriene, ABaranauskiene, LTamulaitiene, GManakova, EKairys, VGražulis, STumkevicius, SMatulis, D Design of [(2-pyrimidinylthio)acetyl]benzenesulfonamides as inhibitors of human carbonic anhydrases. Eur J Med Chem51:259-70 (2012) 
 
Carbonic anhydrase 1
Name:Carbonic anhydrase 1
Type:Enzyme
Mol. Mass.:28873.37
Organism:Homo sapiens (Human)
Description:P00915
Residue:261
BDBM50380147
NameBDBM50380147
Synonyms:CHEMBL2011158
TypeSmall organic molecule
Emp. Form.C14H13NO3S2
Mol. Mass.307.388
SMILESNS(=O)(=O)c1ccc(cc1)C(=O)CSc1ccccc1