Reaction Details
TargetCarbonic anhydrase 7
LigandBDBM50380139
Substrate/Competitorn/a
Meas. Tech.ChEMBL_811725 (CHEMBL2014300)
Kd 710±n/a nM
Citation Capkauskaite, EZubriene, ABaranauskiene, LTamulaitiene, GManakova, EKairys, VGražulis, STumkevicius, SMatulis, D Design of [(2-pyrimidinylthio)acetyl]benzenesulfonamides as inhibitors of human carbonic anhydrases. Eur J Med Chem51:259-70 (2012) 
 
Carbonic anhydrase 7
Name:Carbonic anhydrase 7
Type:Enzyme
Mol. Mass.:29664.11
Organism:Homo sapiens (Human)
Description:Human cloned isozyme.
Residue:264
BDBM50380139
NameBDBM50380139
Synonyms:CHEMBL2011157
TypeSmall organic molecule
Emp. Form.C14H12ClNO3S2
Mol. Mass.341.833
SMILESNS(=O)(=O)c1cc(ccc1Cl)C(=O)CSc1ccccc1