Reaction Details
TargetCarbonic anhydrase 1
LigandBDBM50380148
Substrate/Competitorn/a
Meas. Tech.ChEMBL_811722 (CHEMBL2014297)
Kd 110±n/a nM
Citation Capkauskaite, EZubriene, ABaranauskiene, LTamulaitiene, GManakova, EKairys, VGražulis, STumkevicius, SMatulis, D Design of [(2-pyrimidinylthio)acetyl]benzenesulfonamides as inhibitors of human carbonic anhydrases. Eur J Med Chem51:259-70 (2012) 
 
Carbonic anhydrase 1
Name:Carbonic anhydrase 1
Type:Enzyme
Mol. Mass.:28873.37
Organism:Homo sapiens (Human)
Description:P00915
Residue:261
BDBM50380148
NameBDBM50380148
Synonyms:CHEMBL2011156 | carbonic anhydrase (CA) inhibitors, benzenesulphonamide ligand, 6
TypeSmall organic molecule
Emp. Form.C12H11N3O3S2
Mol. Mass.309.364
SMILESNS(=O)(=O)c1ccc(cc1)C(=O)CSc1ncccn1