Reaction Details
TargetCarbonic anhydrase 13
LigandBDBM50380140
Substrate/Competitorn/a
Meas. Tech.ChEMBL_811727 (CHEMBL2014302)
Kd 330±n/a nM
Citation Capkauskaite, EZubriene, ABaranauskiene, LTamulaitiene, GManakova, EKairys, VGražulis, STumkevicius, SMatulis, D Design of [(2-pyrimidinylthio)acetyl]benzenesulfonamides as inhibitors of human carbonic anhydrases. Eur J Med Chem51:259-70 (2012) 
 
Carbonic anhydrase 13
Name:Carbonic anhydrase 13
Type:Enzyme
Mol. Mass.:29445.78
Organism:Homo sapiens (Human)
Description:Q8N1Q1
Residue:262
BDBM50380140
NameBDBM50380140
Synonyms:CHEMBL2011155 | carbonic anhydrase (CA) inhibitors, benzenesulphonamide ligand, 10
TypeSmall organic molecule
Emp. Form.C12H10ClN3O3S2
Mol. Mass.343.809
SMILESNS(=O)(=O)c1cc(ccc1Cl)C(=O)CSc1ncccn1