Reaction Details
TargetCarbonic anhydrase 13
LigandBDBM50380141
Substrate/Competitorn/a
Meas. Tech.ChEMBL_811728 (CHEMBL2014303)
Kd 160±n/a nM
Citation Capkauskaite, EZubriene, ABaranauskiene, LTamulaitiene, GManakova, EKairys, VGražulis, STumkevicius, SMatulis, D Design of [(2-pyrimidinylthio)acetyl]benzenesulfonamides as inhibitors of human carbonic anhydrases. Eur J Med Chem51:259-70 (2012) 
 
Carbonic anhydrase 13
Name:Carbonic anhydrase 13
Type:Enzyme
Mol. Mass.:29445.78
Organism:Homo sapiens (Human)
Description:Q8N1Q1
Residue:262
BDBM50380141
NameBDBM50380141
Synonyms:CHEMBL2010807
TypeSmall organic molecule
Emp. Form.C16H18ClN3O3S2
Mol. Mass.399.915
SMILESCCCCc1cnc(SCC(=O)c2ccc(Cl)c(c2)S(N)(=O)=O)nc1