Reaction Details
TargetCarbonic anhydrase 2
LigandBDBM50380156
Substrate/Competitorn/a
Meas. Tech.ChEMBL_811724 (CHEMBL2014299)
Kd 93±n/a nM
Citation Capkauskaite, EZubriene, ABaranauskiene, LTamulaitiene, GManakova, EKairys, VGražulis, STumkevicius, SMatulis, D Design of [(2-pyrimidinylthio)acetyl]benzenesulfonamides as inhibitors of human carbonic anhydrases. Eur J Med Chem51:259-70 (2012) 
 
Carbonic anhydrase 2
Name:Carbonic anhydrase 2
Type:Enzyme
Mol. Mass.:29250.71
Organism:Homo sapiens (Human)
Description:P00918
Residue:260
BDBM50380156
NameBDBM50380156
Synonyms:CHEMBL2010990
TypeSmall organic molecule
Emp. Form.C20H19N3O4S2
Mol. Mass.429.513
SMILESCc1nc(SCC(=O)c2ccc(cc2)S(N)(=O)=O)[nH]c(=O)c1Cc1ccccc1