Reaction Details
TargetCarbonic anhydrase 1
LigandBDBM50380144
Substrate/Competitorn/a
Meas. Tech.ChEMBL_811721 (CHEMBL2014296)
Kd 1.9±n/a nM
Citation Capkauskaite, EZubriene, ABaranauskiene, LTamulaitiene, GManakova, EKairys, VGražulis, STumkevicius, SMatulis, D Design of [(2-pyrimidinylthio)acetyl]benzenesulfonamides as inhibitors of human carbonic anhydrases. Eur J Med Chem51:259-70 (2012) 
 
Carbonic anhydrase 1
Name:Carbonic anhydrase 1
Type:Enzyme
Mol. Mass.:28873.37
Organism:Homo sapiens (Human)
Description:P00915
Residue:261
BDBM50380144
NameBDBM50380144
Synonyms:CHEMBL2010994 | carbonic anhydrase (CA) inhibitors, benzenesulphonamide ligand, 8
TypeSmall organic molecule
Emp. Form.C16H19N3O4S2
Mol. Mass.381.47
SMILESCC(C)(C)c1cc(=O)[nH]c(SCC(=O)c2ccc(cc2)S(N)(=O)=O)n1