Reaction Details
TargetCarboxylic ester hydrolase
LigandBDBM50380204
Substrate/Competitorn/a
Meas. Tech.ChEMBL_811911 (CHEMBL2013281)
Ki 7600±n/a nM
Citation Cho, JKRyu, YBCurtis-Long, MJRyu, HWYuk, HJKim, DWKim, HJLee, WSPark, KH Cholinestrase inhibitory effects of geranylated flavonoids from Paulownia tomentosa fruits. Bioorg Med Chem20:2595-602 (2012) 
 
Carboxylic ester hydrolase
Name:Carboxylic ester hydrolase
Type:Protein
Mol. Mass.:68842.83
Organism:Equus caballus (Horse)
Description:Q9N1N9
Residue:602
BDBM50380204
NameBDBM50380204
Synonyms:CHEMBL2011405 | US10406136, Compound 6
TypeSmall organic molecule
Emp. Form.C26H30O7
Mol. Mass.454.5122
SMILES[#6]-[#8]-c1c(-[#8])cc(cc1-[#8])-[#6]-1-[#6]-[#6](=O)-c2c(-[#8])c(-[#6]\[#6]=[#6](/[#6])-[#6]-[#6]\[#6]=[#6](\[#6])-[#6])c(-[#8])cc2-[#8]-1