Reaction Details
TargetSteryl-sulfatase
LigandBDBM50380223
Substrate/Competitorn/a
Meas. Tech.ChEMBL_811916 (CHEMBL2013286)
IC50 0.1±n/a nM
Citation Lawrence Woo, LWLeblond, BPurohit, APotter, BV Synthesis and evaluation of analogues of estrone-3-O-sulfamate as potent steroid sulfatase inhibitors. Bioorg Med Chem20:2506-19 (2012) 
 
Steryl-sulfatase
Name:Steryl-sulfatase
Type:Enzyme
Mol. Mass.:65503.66
Organism:Homo sapiens (Human)
Description:P08842
Residue:583
BDBM50380223
NameBDBM50380223
Synonyms:CHEMBL2011422
TypeSmall organic molecule
Emp. Form.C19H23F2NO4S
Mol. Mass.399.452
SMILESC[C@]12CC[C@H]3[C@@H](CCc4cc(OS(N)(=O)=O)c(cc34)C(F)F)[C@@H]1CCC2=O