Reaction Details
TargetKetohexokinase
LigandBDBM50380256
Substrate/Competitorn/a
Meas. Tech.ChEMBL_813545 (CHEMBL2019654)
IC50 30±n/a nM
Citation Maryanoff, BEMcComsey, DFYabut, SCLuci, DKJordan, ADMasucci, JAJones, WJAbad, MCGibbs, ACPetrounia, I Inhibitors of Ketohexokinase: Discovery of Pyrimidinopyrimidines with Specific Substitution that Complements the ATP-Binding Site. ACS Med Chem Lett2:538-543 (2011) 
 
Ketohexokinase
Name:Ketohexokinase
Type:Enzyme Catalytic Domain
Mol. Mass.:32521.64
Organism:Homo sapiens (Human)
Description:n/a
Residue:298
BDBM50380256
NameBDBM50380256
Synonyms:CHEMBL2017245
TypeSmall organic molecule
Emp. Form.C22H24N8S2
Mol. Mass.464.61
SMILESCSc1ccccc1Nc1nc(nc2c(NCc3cccs3)ncnc12)N1CCNCC1