Reaction Details
TargetKetohexokinase
LigandBDBM50380258
Substrate/Competitorn/a
Meas. Tech.ChEMBL_813545 (CHEMBL2019654)
IC50 540±n/a nM
Citation Maryanoff, BEMcComsey, DFYabut, SCLuci, DKJordan, ADMasucci, JAJones, WJAbad, MCGibbs, ACPetrounia, I Inhibitors of Ketohexokinase: Discovery of Pyrimidinopyrimidines with Specific Substitution that Complements the ATP-Binding Site. ACS Med Chem Lett2:538-543 (2011) 
 
Ketohexokinase
Name:Ketohexokinase
Type:Enzyme Catalytic Domain
Mol. Mass.:32521.64
Organism:Homo sapiens (Human)
Description:n/a
Residue:298
BDBM50380258
NameBDBM50380258
Synonyms:CHEMBL2017224
TypeSmall organic molecule
Emp. Form.C20H23ClN8
Mol. Mass.410.903
SMILESClc1ccccc1Nc1nc(nc2c(NCC3CC3)ncnc12)N1CCNCC1