Reaction Details
TargetKetohexokinase
LigandBDBM50380275
Substrate/Competitorn/a
Meas. Tech.ChEMBL_813545 (CHEMBL2019654)
IC50 18±n/a nM
Citation Maryanoff, BEMcComsey, DFYabut, SCLuci, DKJordan, ADMasucci, JAJones, WJAbad, MCGibbs, ACPetrounia, I Inhibitors of Ketohexokinase: Discovery of Pyrimidinopyrimidines with Specific Substitution that Complements the ATP-Binding Site. ACS Med Chem Lett2:538-543 (2011) 
 
Ketohexokinase
Name:Ketohexokinase
Type:Enzyme Catalytic Domain
Mol. Mass.:32521.64
Organism:Homo sapiens (Human)
Description:n/a
Residue:298
BDBM50380275
NameBDBM50380275
Synonyms:CHEMBL2017242
TypeSmall organic molecule
Emp. Form.C22H28N8S
Mol. Mass.436.576
SMILESCSc1ccccc1Nc1nc(nc2c(NCC3CCC3)ncnc12)N1CCNCC1