Reaction Details
TargetSerine/threonine-protein kinase pim-2
LigandBDBM50380246
Substrate/Competitorn/a
Meas. Tech.ChEMBL_813573 (CHEMBL2019682)
IC50>40000±n/a nM
Citation Maryanoff, BEMcComsey, DFYabut, SCLuci, DKJordan, ADMasucci, JAJones, WJAbad, MCGibbs, ACPetrounia, I Inhibitors of Ketohexokinase: Discovery of Pyrimidinopyrimidines with Specific Substitution that Complements the ATP-Binding Site. ACS Med Chem Lett2:538-543 (2011) 
 
Serine/threonine-protein kinase pim-2
Name:Serine/threonine-protein kinase pim-2
Type:Serine/threonine-protein kinase
Mol. Mass.:34185.93
Organism:Homo sapiens (Human)
Description:Q9P1W9
Residue:311
BDBM50380246
NameBDBM50380246
Synonyms:CHEMBL2017214
TypeSmall organic molecule
Emp. Form.C21H26N8S
Mol. Mass.422.55
SMILESCSc1ccccc1Nc1nc(nc2c(NCC3CC3)ncnc12)N1CCNCC1