Reaction Details
TargetMAP kinase-activated protein kinase 2
LigandBDBM50380310
Substrate/Competitorn/a
Meas. Tech.ChEMBL_813703 (CHEMBL2019905)
EC50 530±n/a nM
Citation Huang, XShipps, GWCheng, CCSpacciapoli, PZhang, XMcCoy, MAWyss, DFYang, XAchab, ASoucy, KMontavon, DKMurphy, DMWhitehurst, CE Discovery and Hit-to-Lead Optimization of Non-ATP Competitive MK2 (MAPKAPK2) Inhibitors. ACS Med Chem Lett2:632-637 (2011) 
 
MAP kinase-activated protein kinase 2
Name:MAP kinase-activated protein kinase 2
Type:Serine/threonine-protein kinase
Mol. Mass.:45579.87
Organism:Homo sapiens (Human)
Description:P49137
Residue:400
BDBM50380310
NameBDBM50380310
Synonyms:CHEMBL2017619
TypeSmall organic molecule
Emp. Form.C27H25ClN4O2
Mol. Mass.472.966
SMILESClc1ccc(cc1)-c1ccc(o1)C(=O)N(Cc1ccncc1)c1ccc(cc1)N1CCNCC1