Reaction Details
TargetPhosphatidylinositol 4,5-bisphosphate 3-kinase catalytic subunit alpha isoform
LigandBDBM50380317
Substrate/Competitorn/a
Meas. Tech.ChEMBL_813831 (CHEMBL2020200)
Ki 230±n/a nM
Citation Liu, KKZhu, JSmith, GLYin, MJBailey, SChen, JHHu, QHuang, QLi, CLi, QJMarx, MAPaderes, GRichardson, PFSach, NWWalls, MWells, PABaxi, SZou, A Highly Selective and Potent Thiophenes as PI3K Inhibitors with Oral Antitumor Activity. ACS Med Chem Lett2:809-813 (2011) 
 
Phosphatidylinositol 4,5-bisphosphate 3-kinase catalytic subunit alpha isoform
Name:Phosphatidylinositol 4,5-bisphosphate 3-kinase catalytic subunit alpha isoform
Type:Enzyme Subunit
Mol. Mass.:124294.87
Organism:Homo sapiens (Human)
Description:P42336
Residue:1068
BDBM50380317
NameBDBM50380317
Synonyms:CHEMBL570592
TypeSmall organic molecule
Emp. Form.C16H13ClN2O3S
Mol. Mass.348.804
SMILESOC(=O)c1sc(N2CCOCC2)c(C#N)c1-c1ccc(Cl)cc1