Reaction Details
TargetPhosphatidylinositol 4,5-bisphosphate 3-kinase catalytic subunit alpha isoform
LigandBDBM50380320
Substrate/Competitorn/a
Meas. Tech.ChEMBL_813833 (CHEMBL2020202)
IC50 35±n/a nM
Citation Liu, KKZhu, JSmith, GLYin, MJBailey, SChen, JHHu, QHuang, QLi, CLi, QJMarx, MAPaderes, GRichardson, PFSach, NWWalls, MWells, PABaxi, SZou, A Highly Selective and Potent Thiophenes as PI3K Inhibitors with Oral Antitumor Activity. ACS Med Chem Lett2:809-813 (2011) 
 
Phosphatidylinositol 4,5-bisphosphate 3-kinase catalytic subunit alpha isoform
Name:Phosphatidylinositol 4,5-bisphosphate 3-kinase catalytic subunit alpha isoform
Type:Enzyme Subunit
Mol. Mass.:124294.87
Organism:Homo sapiens (Human)
Description:P42336
Residue:1068
BDBM50380320
NameBDBM50380320
Synonyms:CHEMBL2017653
TypeSmall organic molecule
Emp. Form.C17H13Cl2N5OS
Mol. Mass.406.289
SMILESClc1ccc(-c2c(sc(N3CCOCC3)c2C#N)-c2nnc[nH]2)c(Cl)c1