Reaction Details
TargetPhosphatidylinositol 4,5-bisphosphate 3-kinase catalytic subunit alpha isoform
LigandBDBM50380321
Substrate/Competitorn/a
Meas. Tech.ChEMBL_813833 (CHEMBL2020202)
IC50 79±n/a nM
Citation Liu, KKZhu, JSmith, GLYin, MJBailey, SChen, JHHu, QHuang, QLi, CLi, QJMarx, MAPaderes, GRichardson, PFSach, NWWalls, MWells, PABaxi, SZou, A Highly Selective and Potent Thiophenes as PI3K Inhibitors with Oral Antitumor Activity. ACS Med Chem Lett2:809-813 (2011) 
 
Phosphatidylinositol 4,5-bisphosphate 3-kinase catalytic subunit alpha isoform
Name:Phosphatidylinositol 4,5-bisphosphate 3-kinase catalytic subunit alpha isoform
Type:Enzyme Subunit
Mol. Mass.:124294.87
Organism:Homo sapiens (Human)
Description:P42336
Residue:1068
BDBM50380321
NameBDBM50380321
Synonyms:CHEMBL2017654
TypeSmall organic molecule
Emp. Form.C18H13FN6OS
Mol. Mass.380.399
SMILESFc1cc(ccc1-c1c(sc(N2CCOCC2)c1C#N)-c1nnc[nH]1)C#N